{"text_format":"3","workbook":"xlsx","n_sheets":3,"sheets":["Datos de ventas","Informe de ventas","Inventario"],"not_rendered":{"defined_names":10,"pivot_tables":1},"read":"whole","date_system":"1900"}

{"sheet":"Datos de ventas","index":0,"n_rows":13,"n_cols":11,"rows_kept":13}
[]
[null,"VENTAS EN EFECTIVO EN LA CAJA REGISTRADORA"]
[]
[]
[]
[{"$nulls":10}," "]
[{"$nulls":10}," "]
[null,"FECHA","HORA","NÚMERO DE TRANSACCIÓN","SKU/NÚMERO DE PRODUCTO","DESCRIPCIÓN","MONTO DE VENTAS","% DE IMPUESTO","IMPUESTO A LAS VENTAS","TOTAL"]
[null,"2012-02-01","10:30:00",1001,90001,{"$f":"IFERROR(IF(ISNA(VLOOKUP(tblDatosDeVentas[[#This Row],[SKU/NÚMERO DE PRODUCTO]],tblInventory[],2,0)),\"\",VLOOKUP(tblDatosDeVentas[[#This Row],[SKU/NÚMERO DE PRODUCTO]],tblInventory[],2,0)),\"No se encontró ninguna descripción\")","v":"Frazada"},{"v":74.95,"d":"74.95 €"},{"v":0.05,"d":"5.00%"},{"$f":"tblDatosDeVentas[[#This Row],[MONTO DE VENTAS]]*tblDatosDeVentas[[#This Row],[% DE IMPUESTO]]","v":{"v":3.7475000000000005,"d":"3.75 €"}},{"$f":"tblDatosDeVentas[[#This Row],[MONTO DE VENTAS]]+tblDatosDeVentas[[#This Row],[IMPUESTO A LAS VENTAS]]","v":{"v":78.6975,"d":"78.70 €"}}]
[null,"2012-02-01","10:33:00",1002,90023,{"$f":"IFERROR(IF(ISNA(VLOOKUP(tblDatosDeVentas[[#This Row],[SKU/NÚMERO DE PRODUCTO]],tblInventory[],2,0)),\"\",VLOOKUP(tblDatosDeVentas[[#This Row],[SKU/NÚMERO DE PRODUCTO]],tblInventory[],2,0)),\"No se encontró ninguna descripción\")","v":"Mantel, 15 cm redondo"},{"v":34.99,"d":"34.99 €"},{"v":0.05,"d":"5.00%"},{"$f":"tblDatosDeVentas[[#This Row],[MONTO DE VENTAS]]*tblDatosDeVentas[[#This Row],[% DE IMPUESTO]]","v":{"v":1.7495000000000003,"d":"1.75 €"}},{"$f":"tblDatosDeVentas[[#This Row],[MONTO DE VENTAS]]+tblDatosDeVentas[[#This Row],[IMPUESTO A LAS VENTAS]]","v":{"v":36.7395,"d":"36.74 €"}}]
[null,"2012-02-01","10:45:00",1003,90005,{"$f":"IFERROR(IF(ISNA(VLOOKUP(tblDatosDeVentas[[#This Row],[SKU/NÚMERO DE PRODUCTO]],tblInventory[],2,0)),\"\",VLOOKUP(tblDatosDeVentas[[#This Row],[SKU/NÚMERO DE PRODUCTO]],tblInventory[],2,0)),\"No se encontró ninguna descripción\")","v":"Plato redondo"},{"v":55.95,"d":"55.95 €"},{"v":0.05,"d":"5.00%"},{"$f":"tblDatosDeVentas[[#This Row],[MONTO DE VENTAS]]*tblDatosDeVentas[[#This Row],[% DE IMPUESTO]]","v":{"v":2.7975000000000003,"d":"2.80 €"}},{"$f":"tblDatosDeVentas[[#This Row],[MONTO DE VENTAS]]+tblDatosDeVentas[[#This Row],[IMPUESTO A LAS VENTAS]]","v":{"v":58.7475,"d":"58.75 €"}}]
[null,"2012-02-01","10:55:00",1004,90004,{"$f":"IFERROR(IF(ISNA(VLOOKUP(tblDatosDeVentas[[#This Row],[SKU/NÚMERO DE PRODUCTO]],tblInventory[],2,0)),\"\",VLOOKUP(tblDatosDeVentas[[#This Row],[SKU/NÚMERO DE PRODUCTO]],tblInventory[],2,0)),\"No se encontró ninguna descripción\")","v":"Plato cuadrado"},{"v":2.95,"d":"2.95 €"},{"v":0.05,"d":"5.00%"},{"$f":"tblDatosDeVentas[[#This Row],[MONTO DE VENTAS]]*tblDatosDeVentas[[#This Row],[% DE IMPUESTO]]","v":{"v":0.14750000000000002,"d":"0.15 €"}},{"$f":"tblDatosDeVentas[[#This Row],[MONTO DE VENTAS]]+tblDatosDeVentas[[#This Row],[IMPUESTO A LAS VENTAS]]","v":{"v":3.0975,"d":"3.10 €"}}]
[null,"2012-02-01","11:45:00",1005,90002,{"$f":"IFERROR(IF(ISNA(VLOOKUP(tblDatosDeVentas[[#This Row],[SKU/NÚMERO DE PRODUCTO]],tblInventory[],2,0)),\"\",VLOOKUP(tblDatosDeVentas[[#This Row],[SKU/NÚMERO DE PRODUCTO]],tblInventory[],2,0)),\"No se encontró ninguna descripción\")","v":"Almohada"},{"v":14.98,"d":"14.98 €"},{"v":0.05,"d":"5.00%"},{"$f":"tblDatosDeVentas[[#This Row],[MONTO DE VENTAS]]*tblDatosDeVentas[[#This Row],[% DE IMPUESTO]]","v":{"v":0.7490000000000001,"d":"0.75 €"}},{"$f":"tblDatosDeVentas[[#This Row],[MONTO DE VENTAS]]+tblDatosDeVentas[[#This Row],[IMPUESTO A LAS VENTAS]]","v":{"v":15.729000000000001,"d":"15.73 €"}}]

{"sheet":"Informe de ventas","index":1,"n_rows":14,"n_cols":7,"rows_kept":14}
[]
[null,"VENTAS EN EFECTIVO EN LA CAJA REGISTRADORA"]
[]
[]
[]
[]
[]
[null,"SKU/NÚMERO DE PRODUCTO","DESCRIPCIÓN","FECHA","Monto de las ventas ","Impuesto a las ventas","Total "]
[null,90001,"Frazada","2012-02-01",{"v":74.95,"d":"74.95 €"},{"v":3.7475000000000005,"d":"3.75 €"},{"v":78.6975,"d":"78.70 €"}]
[null,90002,"Almohada","2012-02-01",{"v":14.98,"d":"14.98 €"},{"v":0.7490000000000001,"d":"0.75 €"},{"v":15.729000000000001,"d":"15.73 €"}]
[null,90004,"Plato cuadrado","2012-02-01",{"v":2.95,"d":"2.95 €"},{"v":0.14750000000000002,"d":"0.15 €"},{"v":3.0975,"d":"3.10 €"}]
[null,90005,"Plato redondo","2012-02-01",{"v":55.95,"d":"55.95 €"},{"v":2.7975000000000003,"d":"2.80 €"},{"v":58.7475,"d":"58.75 €"}]
[null,90023,"Mantel, 15 cm redondo","2012-02-01",{"v":34.99,"d":"34.99 €"},{"v":1.7495000000000003,"d":"1.75 €"},{"v":36.7395,"d":"36.74 €"}]
[null,"Total",null,null,{"v":183.82000000000002,"d":"183.82 €"},{"v":9.191000000000003,"d":"9.19 €"},{"v":193.011,"d":"193.01 €"}]

{"sheet":"Inventario","index":2,"n_rows":31,"n_cols":3,"rows_kept":31}
[]
[null,"VENTAS EN EFECTIVO EN LA CAJA REGISTRADORA"]
[]
[]
[]
[]
[]
[null,"SKU/NÚMERO DE PRODUCTO","DESCRIPCIÓN"]
[null,90001,"Frazada"]
[null,90002,"Almohada"]
[null,90003,"Sábanas"]
[null,90004,"Plato cuadrado"]
[null,90005,"Plato redondo"]
[null,90006,"Tazón, grande"]
[null,90007,"Tazón, pequeño"]
[null,90008,"Plato redondo, pequeño"]
[null,90009,"Tenedor, pequeño"]
[null,90010,"Tenedor, grande"]
[null,90011,"Cuchara, pequeña"]
[null,90012,"Cuchara, grande"]
[null,90013,"Cuchillo para manteca, pequeño"]
[null,90014,"Cuchillo para manteca, grande"]
[null,90015,"Mantel, 10x5"]
[null,90016,"Mantel, 8x5"]
[null,90017,"Mantel, 8x8"]
[null,90018,"Mantel, 6x6"]
[null,90019,"Mantel, 6x4"]
[null,90020,"Mantel, 4x4"]
[null,90021,"Mantel, 25 cm redondo"]
[null,90022,"Mantel, 20 cm redondo"]
[null,90023,"Mantel, 15 cm redondo"]